{"text_format":"1","workbook":"xlsx","n_sheets":14,"sheets":["AR TOC","AR1","AR2","AR2-2","AR3","AR4","AR5","AR6","AR6-2","AR7","AR8","AR9","AR10","Drop down lists"],"not_rendered":{"charts":0,"images":0,"macros":1,"external_links":13,"defined_names":481,"comments":0,"pivot_tables":0},"unopened":[],"bounds":{"document_bytes":16777216,"sheet_cells":100000,"rows_first":2000,"rows_last":500,"rows_between":2000,"halvings":0,"cell_chars":16384,"cell_head_chars":4096},"cells_cut":0,"cells_raw":0,"read":"whole","date_system":"1900"}

{"sheet":"AR TOC","index":0,"n_rows":38,"n_cols":5,"rows_kept":38,"cut":false,"hidden":false,"merged":[[12,0,12,1],[32,0,35,4],[37,0,38,4]]}
[{"$f":"'AR1'!$B$12","v":0}]
["Annual Report"]
["Table of Contents"]
[]
[]
[]
[null,"TABLE OF CONTENTS"]
[]
["Company Name:",{"$f":"IF('AR1'!B12=\"\",\"\",'AR1'!B12)","v":""}]
["Test Year:",{"$f":"IF('AR1'!B19=\"\",\"\",'AR1'!B19)","v":"12/31/19"}]
[]
[]
["Table of contents:",null,"Page No.","Complete"]
["AR 1","COVER PAGE 1","Page 1",{"$f":"'AR1'!N44","v":"Incomplete"}]
["AR 2","COVER PAGE 2",{"$f":"'AR2'!J50","v":"Page 2"},{"$f":"'AR2'!S50","v":"Incomplete"}]
{"$rows_left_out":24}
{"sheet":"AR1","index":1,"n_rows":48,"n_cols":14,"rows_kept":48,"cut":false,"hidden":false,"merged":[[17,1,17,2],[12,0,15,0],[7,0,7,8],[9,0,9,8],[11,1,11,8],[14,1,14,3],[13,1,13,8],[12,1,12,8],[41,5,41,7],[34,0,34,8],[35,0,35,8],[36,0,36,8],[37,0,37,8],[24,0,24,8],[26,0,26,8],[28,0,28,8],[32,0,32,8],[33,0,33,8]]}
[null,null,null,null,null,null,null,null,null,"AR 1"]
[null,null,null,null,null,null,null,null,null,{"$f":"\"Annual Report Page \"&I48","v":"Annual Report Page 1"}]
[]
[]
[]
[]
[]
["ANNUAL REPORT",null,null,null,null,null,null,null,null,null,"Table of Contents"]
[]
["Of"]
[null,null,null,null,null,null,null,null,null,null,null,"Email address:"]
["Company Name: ",null,null,null,null,null,null,null,null,null,null,{"$f":"IF(B12=\"\",\"\",VLOOKUP(B12, 'Drop down lists'!$M$2:$T$255, 8, FALSE))","v":""},{"$f":"IF(B12<>\"\",\"Complete\",\"Incomplete\")","v":"Incomplete"}]
["Mailing Address:",{"$f":"IF(B12=\"\",\"\",VLOOKUP(B12, 'Drop down lists'!$M$2:$T$255, 3, FALSE))","v":""}]
[null,{"$f":"IF(B12=\"\",\"\",VLOOKUP(B12, 'Drop down lists'!$M$2:$T$255, 4, FALSE))","v":""}]
[null,{"$f":"IF(B12=\"\",\"\",VLOOKUP(B12, 'Drop down lists'!$M$2:$T$255, 5, FALSE))","v":""},null,null,{"$f":"IF(B12=\"\",\"\",VLOOKUP(B12, 'Drop down lists'!$M$2:$T$255, 7, FALSE))","v":""}]
{"$rows_left_out":34}
{"sheet":"AR2","index":2,"n_rows":51,"n_cols":19,"rows_kept":51,"cut":false,"hidden":false,"merged":[[33,1,33,4],[34,1,34,9],[35,1,35,3],[35,6,35,7],[36,1,36,6],[9,1,9,3],[9,6,9,7],[0,0,0,9],[1,0,1,9],[2,0,2,9],[5,0,5,2],[8,1,8,9],[7,1,7,9],[48,1,48,4],[25,1,25,4],[26,1,26,9],[27,1,27,3],[27,6,27,7],[28,1,28,6],[46,1,46,4],[38,0,38,9],[39,1,39,4],[41,1,41,4],[42,1,42,9],[43,1,43,3],[40,1,40,4],[30,0,30,9],[31,1,31,4],[32,1,32,4],[43,6,43,7],[44,1,44,6],[10,7,10,8],[11,1,11,6],[16,1,16,4],[10,1,10,3],[23,1,23,4],[14,0,14,9],[15,1,15,4],[17,1,17,4],[18,1,18,9],[19,1,19,3],[19,6,19,7],[20,1,20,6],[22,0,22,9],[24,1,24,4]]}
["ARIZONA CORPORATION COMMISSION ",null,null,null,null,null,null,null,null,null,"AR 2"]
["ELECTRIC UTILITIY ANNUAL REPORT",null,null,null,null,null,null,null,null,null,{"$f":"\"Annual Report Page \"&J51","v":"Annual Report Page 2"}]
["COMPANY INFORMATION"]
[]
[]
["For the Calendar Year Ended:",null,null,{"$f":"IF('AR1'!B19=\"\",\"\",'AR1'!B19)","v":"12/31/19"}]
[]
["Company/Business Name: "]
["Mailing Address: ",null,null,null,null,null,null,null,null,null,null,"Table of Contents",null,null,{"$f":"IF(B9=0,\"Incomplete\",\"Complete\")","v":"Incomplete"}]
["City:",null,null,null,null,"State:",null,null,"Zip Code:",null,null,null,null,null,{"$f":"IF(B10=0,\"Incomplete\",\"Complete\")","v":"Incomplete"},{"$f":"IF(G10=0,\"Incomplete\",\"Complete\")","v":"Incomplete"},{"$f":"IF(J10=0,\"Incomplete\",\"Complete\")","v":"Incomplete"},{"$f":"IF(O10=\"Incomplete\",\"Incomplete\",IF(P10=\"Incomplete\",\"Incomplete\",IF(Q10=\"Incomplete\",\"Incomplete\",\"Complete\")))","v":"Incomplete"}]
["Telephone Number:",null,null,null,null,null,"Fax Number:",null,null,null,null,null,null,null,{"$f":"IF(B11=0,\"Incomplete\",\"Complete\")","v":"Incomplete"}]
["Email:"]
[null,null,null,null,null,null,null,null,null,null,null,null,null,null,null,null,null,null,{"$f":"IF(O9=\"Incomplete\",\"Incomplete\",IF(R10=\"Incomplete\",\"Incomplete\",IF(#REF!=\"Incomplete\",\"Incomplete\",IF(O11=\"Incomplete\",\"Incomplete\",\"Complete\"))))","v":"Incomplete"}]
[]
[]
{"$rows_left_out":37}
{"sheet":"AR2-2","index":3,"n_rows":43,"n_cols":20,"rows_kept":43,"cut":false,"hidden":false,"merged":[[9,1,13,12],[17,1,17,12],[18,1,18,12],[19,1,23,12],[0,0,0,12],[1,0,1,12],[2,0,2,12],[4,0,4,12],[6,1,7,12],[8,1,8,12]]}
["ARIZONA CORPORATION COMMISSION ",null,null,null,null,null,null,null,null,null,null,null,null,"AR 2"]
["ELECTRIC UTILITIY ANNUAL REPORT",null,null,null,null,null,null,null,null,null,null,null,null,{"$f":"\"Annual Report Page \"&M71","v":"Annual Report Page "}]
[{"$f":"'AR1'!B12","v":0}]
[]
["Important changes during the year"]
[]
[null,"For those companies not subject to the affiliated interest rules, has there been a change in ownership or direct control during the year?",null,null,null,null,null,null,null,null,null,null,null,null,null,null,null,{"$f":"IF(A7=0,\"Incomplete\",\"Complete\")","v":"Incomplete"},{"$f":"IF(B10=0,\"Incomplete\",\"Complete\")","v":"Incomplete"}]
[]
[null,"If yes, please provide specific details in the box below."]
[]
[]
[]
[]
[]
[]
{"$rows_left_out":29}
{"sheet":"AR3","index":4,"n_rows":54,"n_cols":10,"rows_kept":54,"cut":false,"hidden":false,"merged":[[35,0,35,2],[25,0,25,2],[24,0,24,2],[6,0,6,3]]}
[{"$f":"'AR1'!$B$12","v":0},null,null,null,"AR 3"]
["ELECTRIC UTILITY ANNUAL REPORT",null,null,null,{"$f":"\"Annual Report Page \"&D54","v":"Annual Report Page 4"}]
["AUTHORIZED SERVICES AND STATISTICAL INFORMATION"]
[{"$f":"IF('AR1'!B19=\"\",\"\",'AR1'!B19)","v":"12/31/19"}]
[]
[]
["SERVICES AUTHORIZED TO PROVIDE",null,null,null,"Table of Contents"]
[]
[null,"Electric",null,null,null,{"$f":"IF(A9<>\"\",\"Complete\",\"Incomplete\")","v":"Incomplete"}]
[null,"     Investor Owned Electric",null,null,null,{"$f":"IF(A10<>\"\",\"Complete\",\"Incomplete\")","v":"Incomplete"}]
[null,"     Rural Electric Cooperative",null,null,null,"Incomplete"]
[null,"     Utility Distributed Company",null,null,null,"Incomplete"]
[null,"     Electric Service Provider",null,null,null,"Incomplete"]
[null,"          Transmission Service Provider",null,null,null,"Incomplete"]
[null,"          Meter Service Provider",null,null,null,"Incomplete",{"$f":"IF(F9=\"Incomplete\",\"Incomplete\",IF(F10=\"Incomplete\",\"Incomplete\",IF(F11=\"Incomplete\",\"Incomplete\",IF(F12=\"Incomplete\",\"Incomplete\",IF(F13=\"Incomplete\",\"Incomplete\",IF(F13=\"Incomplete\",\"Incomplete\",IF(F14=\"Incomplete\",\"Incomplete\",IF(F15=\"Incomplete\",\"Incomplete\",\"Complete\"))))))))","v":"Incomplete"}]
{"$rows_left_out":40}
{"sheet":"AR4","index":5,"n_rows":67,"n_cols":13,"rows_kept":67,"cut":false,"hidden":false,"merged":[[47,11,47,12],[13,1,14,8],[20,1,24,8],[31,1,33,8],[38,4,38,5],[37,3,37,7],[39,4,39,6],[40,6,40,7],[41,4,41,5],[17,1,17,2],[47,5,47,8],[5,0,5,8],[66,0,66,8],[11,3,11,6],[40,4,40,5],[44,5,44,8],[45,5,45,8],[51,7,51,8],[52,7,52,8],[60,5,60,8],[61,5,61,8],[51,3,51,6],[50,3,50,8],[7,2,7,3],[8,2,8,3],[9,4,9,6],[10,4,10,6],[53,4,53,5],[53,7,53,8],[54,7,54,8],[56,3,56,5],[48,5,48,8]]}
[{"$f":"'AR1'!$B$12","v":0},null,null,null,null,null,null,null,null,"AR 4"]
["ELECTRIC UTILITIY ANNUAL REPORT",null,null,null,null,null,null,null,null,{"$f":"\"Annual Report Page \"&I65","v":"Annual Report Page 5"}]
[{"$f":"A6","v":"VERIFICATION AND SWORN STATEMENT (INTRASTATE REVENUE ONLY)"}]
[{"$f":"IF('AR1'!B19=\"\",\"\",'AR1'!B19)","v":"12/31/19"}]
[]
["VERIFICATION AND SWORN STATEMENT (INTRASTATE REVENUE ONLY)"]
["Verification:"]
[null,"State of ",null,null,"I, the undersigned of the "]
[null,null,"(state name)",null,null,null,null,null,null,null,"Table of Contents"]
[null,"County of (county name):"]
[null,"Name (owner or official) title:"]
[null,"Company name:",null,{"$f":"A1","v":0}]
[]
[null,"DO SAY THAT THIS ANNUAL UTILITY PROPERTY TAX AND SALES TAX REPORT TO THE ARIZONA CORPORATION COMMISSION."]
[]
{"$rows_left_out":53}
{"sheet":"AR5","index":6,"n_rows":68,"n_cols":16,"rows_kept":68,"cut":false,"hidden":false,"merged":[[51,7,51,8],[54,7,54,8],[7,4,7,6],[37,4,37,6],[67,0,68,8],[61,4,61,8],[60,4,60,8],[42,5,42,8],[56,3,56,5],[7,2,7,3],[8,2,8,3],[10,4,10,6],[53,4,53,5],[53,7,53,8],[11,4,11,6],[12,3,12,6],[45,5,45,8],[5,0,5,8],[49,3,49,8],[50,3,50,5],[11,1,11,3],[10,1,10,3],[22,1,26,8],[29,1,32,8],[38,4,38,5],[43,5,43,8],[46,5,46,8],[50,7,50,8],[12,1,12,2],[36,4,36,5],[15,1,16,8],[19,1,19,2]]}
[{"$f":"'AR1'!$B$12","v":0},null,null,null,null,null,null,null,null,"AR 5"]
["ELECTRIC UTILITIY ANNUAL REPORT",null,null,null,null,null,null,null,null,{"$f":"\"Annual Report Page \"&I66","v":"Annual Report Page 6"}]
[{"$f":"A6","v":"VERIFICATION AND SWORN STATEMENT (RESIDENTIAL REVENUE)"}]
[{"$f":"IF('AR1'!B19=\"\",\"\",'AR1'!B19)","v":"12/31/19"}]
[]
["VERIFICATION AND SWORN STATEMENT (RESIDENTIAL REVENUE)"]
["Verification:"]
[null,"State of ",null,null,"I, the undersigned of the ",null,null,null,null,null,null,null,null,{"$f":"IF(C8<>\"\",\"Complete\",\"Incomplete\")","v":"Incomplete"}]
[null,null,"(state name)",null,null,null,null,null,null,null,"Table of Contents"]
[]
[null,"County of (county name):",null,null,null,null,null,null,null,null,null,null,null,{"$f":"IF(E11<>\"\",\"Complete\",\"Incomplete\")","v":"Incomplete"}]
[null,"Name (owner or official) title:",null,null,null,null,null,null,null,null,null,null,null,{"$f":"IF(E12<>\"\",\"Complete\",\"Incomplete\")","v":"Incomplete"}]
[null,"Company name:",null,{"$f":"A1","v":0},null,null,null,null,null,null,null,null,null,null,{"$f":"IF(N8=\"Incomplete\",\"Incomplete\",IF(N11=\"Incomplete\",\"Incomplete\",IF(N12=\"Incomplete\",\"Incomplete\",\"Complete\")))","v":"Incomplete"}]
[]
[]
{"$rows_left_out":54}
{"sheet":"AR6","index":7,"n_rows":105,"n_cols":17,"rows_kept":105,"cut":false,"hidden":false,"merged":[[104,0,104,7],[5,0,5,7],[7,0,7,7],[11,0,11,7],[20,0,20,7],[82,0,82,7],[28,0,28,7],[37,0,37,7],[47,0,47,7],[58,0,58,7],[74,0,74,7]]}
[{"$f":"'AR1'!$B$12","v":0},null,null,null,null,null,null,null,"AR 6"]
["ELECTRIC UTILITIY ANNUAL REPORT",null,null,null,null,null,null,null,{"$f":"\"Annual Report Page \"&H101","v":"Annual Report Page 7"}]
[{"$f":"AR7_Page_7","v":"UTILITY PLANT IN SERVICE (ELECTRIC)"}]
[{"$f":"IF('AR1'!B19=\"\",\"\",'AR1'!B19)","v":"12/31/19"}]
[]
["UTILITY PLANT IN SERVICE (ELECTRIC)"]
["Account No.","Description","Beginning Year Original Cost","Current Year Additions","Current Year Retirements","Adjusted Original Cost","Accumulated Depreciation","OCLD (OC less AD)",null,"Table of Contents"]
["Intangible Plant"]
[301,"Organization",null,null,null,{"$f":"C9+D9-E9","v":0},null,{"$f":"F9-G9","v":0},null,null,null,{"$f":"IF(C9<>\"\",\"Complete\",\"Incomplete\")","v":"Incomplete"},{"$f":"IF(D9<>\"\",\"Complete\",\"Incomplete\")","v":"Incomplete"},{"$f":"IF(E9<>\"\",\"Complete\",\"Incomplete\")","v":"Incomplete"},{"$f":"IF(G9<>\"\",\"Complete\",\"Incomplete\")","v":"Incomplete"},{"$f":"IF(L9=\"Incomplete\",\"Incomplete\",IF(M9=\"Incomplete\",\"Incomplete\",IF(N9=\"Incomplete\",\"Incomplete\",IF(O9=\"Incomplete\",\"Incomplete\",\"Complete\"))))","v":"Incomplete"}]
[302,"Franchises and consents",null,null,null,{"$f":"C10+D10-E10","v":0},null,{"$f":"F10-G10","v":0},null,null,null,{"$f":"IF(C10<>\"\",\"Complete\",\"Incomplete\")","v":"Incomplete"},"Incomplete",{"$f":"IF(E10<>\"\",\"Complete\",\"Incomplete\")","v":"Incomplete"},{"$f":"IF(G10<>\"\",\"Complete\",\"Incomplete\")","v":"Incomplete"},{"$f":"IF(L10=\"Incomplete\",\"Incomplete\",IF(M10=\"Incomplete\",\"Incomplete\",IF(N10=\"Incomplete\",\"Incomplete\",IF(O10=\"Incomplete\",\"Incomplete\",\"Complete\"))))","v":"Incomplete"}]
[303,"Miscellaneous intangible plant",null,null,null,{"$f":"C11+D11-E11","v":0},null,{"$f":"F11-G11","v":0},null,null,null,"Incomplete","Incomplete","Incomplete","Incomplete","Incomplete",{"$f":"IF(P9=\"Incomplete\",\"Incomplete\",IF(P10=\"Incomplete\",\"Incomplete\",IF(P11=\"Incomplete\",\"Incomplete\",\"Complete\")))","v":"Incomplete"}]
["Steam Production"]
[310,"Land and land rights",null,null,null,0,null,0,null,null,null,"Incomplete","Incomplete","Incomplete","Incomplete","Incomplete"]
[311,"Structures and improvements",null,null,null,0,null,0,null,null,null,"Incomplete","Incomplete","Incomplete","Incomplete","Incomplete"]
[312,"Boiler plant equipment",null,null,null,0,null,0,null,null,null,"Incomplete","Incomplete","Incomplete","Incomplete","Incomplete"]
{"$rows_left_out":91}
{"sheet":"AR6-2","index":8,"n_rows":55,"n_cols":7,"rows_kept":55,"cut":false,"hidden":true,"merged":[[6,0,6,6],[48,0,51,6]]}
[{"$f":"'AR1'!$B$12","v":0}]
["Annual Report"]
[{"$f":"A7","v":"Full time equivalent employees"}]
[{"$f":"IF('AR1'!B19=\"\",\"\",'AR1'!B19)","v":"12/31/19"}]
[]
[]
["Full time equivalent employees"]
[]
[null,null,"Direct Company","Outside service","Total"]
[null,"President",null,null,{"$f":"C10+D10","v":0}]
[null,"Vice-president",null,null,{"$f":"C11+D11","v":0}]
[null,"Manager",null,null,0]
[null,"Engineering Staff",null,null,0]
[null,"System Operator(s)",null,null,0]
[null,"Meter reader",null,null,0]
{"$rows_left_out":41}
{"sheet":"AR7","index":9,"n_rows":104,"n_cols":16,"rows_kept":104,"cut":false,"hidden":false,"merged":[[103,0,103,9],[48,0,48,9],[59,0,59,9],[75,0,75,9],[83,0,83,9],[38,0,38,9],[6,0,6,9],[8,0,8,9],[12,0,12,9],[21,0,21,9],[29,0,29,9]]}
[{"$f":"'AR1'!$B$12","v":0},null,null,null,null,null,null,null,null,null,"AR7"]
["ELECTRIC UTILITIY ANNUAL REPORT",null,null,null,null,null,null,null,null,null,{"$f":"\"Annual Report Page \"&J101","v":"Annual Report Page 8"}]
[{"$f":"A7","v":"DEPRECIATION EXPENSE FOR THE CURRENT YEAR (ELECTRIC)"}]
[{"$f":"IF('AR1'!B19=\"\",\"\",'AR1'!B19)","v":"12/31/19"}]
[]
[]
["DEPRECIATION EXPENSE FOR THE CURRENT YEAR (ELECTRIC)"]
["Account No.","Description","Beginning Year Original Cost","Current Year Additions","Current Year Retirements","Adjusted Original Cost","Fully Depreciated/Non-depreciable Plant","Depreciable Plant","Depreciation Percentages","Depreciation Expense",null,"Table of Contents"]
["Intangible Plant"]
[{"$f":"'AR6'!A9","v":301},{"$f":"'AR6'!B9","v":"Organization"},{"$f":"'AR6'!C9","v":0},{"$f":"'AR6'!D9","v":0},{"$f":"'AR6'!E9","v":0},{"$f":"'AR6'!F9","v":0},null,{"$f":"F10-G10","v":0},null,{"$f":"((C10-G10)*I10)+((D10*I10)*0.5)-((E10*I10)*0.5)","v":0},null,null,{"$f":"IF(G10<>\"\",\"Complete\",\"Incomplete\")","v":"Incomplete"},{"$f":"IF(I10<>\"\",\"Complete\",\"Incomplete\")","v":"Incomplete"},{"$f":"IF(M10=\"Incomplete\",\"Incomplete\",IF(N10=\"Incomplete\",\"Incomplete\",\"Complete\"))","v":"Incomplete"}]
[{"$f":"'AR6'!A10","v":302},{"$f":"'AR6'!B10","v":"Franchises and consents"},{"$f":"'AR6'!C10","v":0},{"$f":"'AR6'!D10","v":0},{"$f":"'AR6'!E10","v":0},{"$f":"'AR6'!F10","v":0},null,{"$f":"F11-G11","v":0},null,{"$f":"((C11-G11)*I11)+((D11*I11)*0.5)-((E11*I11)*0.5)","v":0},null,null,{"$f":"IF(G11<>\"\",\"Complete\",\"Incomplete\")","v":"Incomplete"},{"$f":"IF(I11<>\"\",\"Complete\",\"Incomplete\")","v":"Incomplete"},{"$f":"IF(M11=\"Incomplete\",\"Incomplete\",IF(N11=\"Incomplete\",\"Incomplete\",\"Complete\"))","v":"Incomplete"}]
[{"$f":"'AR6'!A11","v":303},{"$f":"'AR6'!B11","v":"Miscellaneous intangible plant"},{"$f":"'AR6'!C11","v":0},{"$f":"'AR6'!D11","v":0},{"$f":"'AR6'!E11","v":0},{"$f":"'AR6'!F11","v":0},null,{"$f":"F12-G12","v":0},null,{"$f":"((C12-G12)*I12)+((D12*I12)*0.5)-((E12*I12)*0.5)","v":0},null,null,{"$f":"IF(G12<>\"\",\"Complete\",\"Incomplete\")","v":"Incomplete"},{"$f":"IF(I12<>\"\",\"Complete\",\"Incomplete\")","v":"Incomplete"},"Incomplete",{"$f":"IF(O10=\"Incomplete\",\"Incomplete\",IF(O11=\"Incomplete\",\"Incomplete\",IF(O12=\"Incomplete\",\"Incomplete\",\"Complete\")))","v":"Incomplete"}]
["Steam Production"]
[{"$f":"'AR6'!A13","v":310},{"$f":"'AR6'!B13","v":"Land and land rights"},{"$f":"'AR6'!C13","v":0},{"$f":"'AR6'!D13","v":0},{"$f":"'AR6'!E13","v":0},{"$f":"'AR6'!F13","v":0},null,0,null,0,null,null,{"$f":"IF(G14<>\"\",\"Complete\",\"Incomplete\")","v":"Incomplete"},{"$f":"IF(I14<>\"\",\"Complete\",\"Incomplete\")","v":"Incomplete"},"Incomplete"]
[{"$f":"'AR6'!A14","v":311},{"$f":"'AR6'!B14","v":"Structures and improvements"},{"$f":"'AR6'!C14","v":0},{"$f":"'AR6'!D14","v":0},{"$f":"'AR6'!E14","v":0},{"$f":"'AR6'!F14","v":0},null,0,null,0,null,null,"Incomplete","Incomplete","Incomplete"]
{"$rows_left_out":90}
{"sheet":"AR8","index":10,"n_rows":71,"n_cols":10,"rows_kept":71,"cut":false,"hidden":false,"merged":[[6,0,6,3],[6,5,6,8],[65,5,66,8],[65,0,66,3],[56,5,57,8]]}
[{"$f":"'AR1'!$B$12","v":0},null,null,null,"AR8",{"$f":"A1","v":0},null,null,null,{"$f":"E1","v":"AR8"}]
["ELECTRIC UTILITIY ANNUAL REPORT",null,null,null,{"$f":"\"Annual Report Page \"&D61","v":"Annual Report Page 9"},{"$f":"A2","v":"ELECTRIC UTILITIY ANNUAL REPORT"},null,null,null,{"$f":"\"Annual Report Page \"&I61","v":"Annual Report Page 10"}]
[{"$f":"A7","v":"BALANCE SHEET ASSETS"},null,null,null,null,{"$f":"F7","v":"BALANCE SHEET LIABILITIES AND OWNERS EQUITY"}]
[{"$f":"IF('AR1'!B19=\"\",\"\",'AR1'!B19)","v":"12/31/19"},null,null,null,null,{"$f":"A4","v":"12/31/19"}]
[]
[]
["BALANCE SHEET ASSETS",null,null,null,"Table of Contents","BALANCE SHEET LIABILITIES AND OWNERS EQUITY"]
["Assets and Other Debits",null,{"$f":"\"Balance at Beginning of Year \" &\"(\"&YEAR('AR1'!B19)&\")\"","v":"Balance at Beginning of Year (2019)"},{"$f":"\"Balance at End of Year \" &\"(\"&YEAR('AR1'!B19)&\")\"","v":"Balance at End of Year (2019)"},{"$f":"IF(C62<-5,\"Does not balance\",IF(C62>5,\"Does not balance\",\"\"))","v":""},"Liabilities and Other Credits",null,{"$f":"C8","v":"Balance at Beginning of Year (2019)"},{"$f":"D8","v":"Balance at End of Year (2019)"}]
["Utility Plant",null,null,null,{"$f":"IF(D62<-5,\"Does not balance\",IF(D62>5,\"Does not balance\",\"\"))","v":""},"Current Liabilities"]
["Plant in service",null,{"$f":"'AR6'!C96","v":0},{"$f":"'AR6'!F96","v":0},null,"Accounts payable"]
["Accumulated depreciation and amortization",null,null,{"$f":"-'AR6'!G96","v":0},null,"Customer/Member deposits"]
["Construction work in progress",null,null,null,null,"Current maturities of Long-Term Debt"]
["Palo Verde sale leaseback (net of accumulated amortization)",null,null,null,null,"Accrued expenses"]
["Nuclear fuel (net of accumulate amortization)",null,null,null,null,"Accrued taxes"]
["Total Utility Plant",null,{"$f":"SUM(C10:C14)","v":0},{"$f":"SUM(D10:D14)","v":0},null,"Accrued interest"]
{"$rows_left_out":57}
{"sheet":"AR9","index":11,"n_rows":93,"n_cols":14,"rows_kept":93,"cut":false,"hidden":false,"merged":[[6,0,6,3],[88,0,89,3],[21,0,21,3],[38,0,38,3],[53,0,53,3]]}
[{"$f":"'AR1'!$B$12","v":0},null,null,null,"AR 9"]
["ELECTRIC UTILITIY ANNUAL REPORT",null,null,null,{"$f":"\"Annual Report Page \"&D93","v":"Annual Report Page 11"}]
[{"$f":"A7","v":"ELECTRIC COMPARATIVE INCOME STATEMENT"}]
[{"$f":"IF('AR1'!B19=\"\",\"\",'AR1'!B19)","v":"12/31/19"}]
[]
[]
["ELECTRIC COMPARATIVE INCOME STATEMENT"]
["Account No.","Calendar Year",{"$f":"\"Last Year                            \"&\" 01/01/\"&YEAR('AR1'!B19)-1&\" - 12/31/\"&YEAR('AR1'!B19)-1","v":"Last Year                             01/01/2018 - 12/31/2018"},{"$f":"\"Current Year                            \"&\" 01/01/\"&YEAR('AR1'!B19)&\" - 12/31/\"&YEAR('AR1'!B19)","v":"Current Year                             01/01/2019 - 12/31/2019"},"Table of Contents"]
[null,"Operating Revenue"]
[440,"Residential sales",null,null,null,null,null,{"$f":"ISBLANK(C10)","v":true},true,{"$f":"IF(H10=TRUE,\"Incomplete\",\"Complete\")","v":"Incomplete"},{"$f":"IF(I10=TRUE,\"Incomplete\",\"Complete\")","v":"Incomplete"},{"$f":"IF(J10=\"Incomplete\",\"Incomplete\",IF(K10=\"Incomplete\",\"Incomplete\",\"Complete\"))","v":"Incomplete"}]
[442,"Commercial and industrial sales",null,null,null,null,null,true,true,{"$f":"IF(H11=TRUE,\"Incomplete\",\"Complete\")","v":"Incomplete"},"Incomplete",{"$f":"IF(J11=\"Incomplete\",\"Incomplete\",IF(K11=\"Incomplete\",\"Incomplete\",\"Complete\"))","v":"Incomplete"}]
[444,"Public street and highway lighting",null,null,null,null,null,true,true,"Incomplete","Incomplete","Incomplete"]
[445,"Other sales to public authorities",null,null,null,null,null,true,true,"Incomplete","Incomplete","Incomplete"]
[446,"Sales to railroads and railways",null,null,null,null,null,true,true,"Incomplete","Incomplete","Incomplete"]
[447,"Sales for resale",null,null,null,null,null,true,true,"Incomplete","Incomplete","Incomplete"]
{"$rows_left_out":79}
{"sheet":"AR10","index":12,"n_rows":35,"n_cols":10,"rows_kept":35,"cut":false,"hidden":false,"merged":[[6,0,6,3],[22,1,26,3],[29,0,30,3]]}
[{"$f":"'AR1'!$B$12","v":0},null,null,null,"AR 10"]
["ELECTRIC UTILITIY ANNUAL REPORT",null,null,null,{"$f":"\"Annual Report Page \"&D35","v":"Annual Report Page 12"}]
[{"$f":"A7","v":"UTILITY SHUTOFFS / DISCONNECTS"}]
[{"$f":"IF('AR1'!B19=\"\",\"\",'AR1'!B19)","v":"12/31/19"}]
[]
[]
["UTILITY SHUTOFFS / DISCONNECTS"]
["Month","Termination without Notice R14-2-211.B","Termination with Notice R14-2-211.C","Other"]
["January",null,null,null,null,{"$f":"IF(B9<>\"\",\"Complete\",\"Incomplete\")","v":"Incomplete"},"Incomplete","Incomplete",{"$f":"IF(F9=\"Incomplete\",\"Incomplete\",IF(G9=\"Incomplete\",\"Incomplete\",IF(H9=\"Incomplete\",\"Incomplete\",\"Complete\")))","v":"Incomplete"}]
["February",null,null,null,null,"Incomplete","Incomplete","Incomplete",{"$f":"IF(F10=\"Incomplete\",\"Incomplete\",IF(G10=\"Incomplete\",\"Incomplete\",IF(H10=\"Incomplete\",\"Incomplete\",\"Complete\")))","v":"Incomplete"}]
["March",null,null,null,null,"Incomplete","Incomplete","Incomplete","Incomplete"]
["April",null,null,null,null,"Incomplete","Incomplete","Incomplete","Incomplete"]
["May",null,null,null,null,"Incomplete","Incomplete","Incomplete","Incomplete"]
["June",null,null,null,null,"Incomplete","Incomplete","Incomplete","Incomplete",{"$f":"IF(I9=\"Incomplete\",\"Incomplete\",IF(I10=\"Incomplete\",\"Incomplete\",IF(I11=\"Incomplete\",\"Incomplete\",IF(I12=\"Incomplete\",\"Incomplete\",IF(I12=\"Incomplete\",\"Incomplete\",IF(I13=\"Incomplete\",\"Incomplete\",IF(I14=\"Incomplete\",\"Incomplete\",\"Complete\")))))))","v":"Incomplete"}]
["July",null,null,null,null,"Incomplete","Incomplete","Incomplete","Incomplete"]
{"$rows_left_out":21}
{"sheet":"Drop down lists","index":13,"n_rows":50,"n_cols":22,"rows_kept":50,"cut":false,"hidden":true,"merged":[]}
[null,null,null,null,null,null,null,null,"Alabama",null,"Apache",null,"Company Name - DBA","Docket No","Address","Address2","City","Zip","State","Email Address",null,"ERRF"]
[null,null,null,null,null,null,null,null,"Alaska",null,"Cochise",null,"Ajo Improvement - Electric","E-01025A","PO Drawer 9",null,"Ajo",85321,"AZ","htaylor@fmi.com; dmedina@fmi.com",null,"Source Wells"]
[null,null,"Yes",null,null,null,"One",null,"Arizona",null,"Coconino",null,"Arizona Electric Power Cooperative","E-01773A",null,null,null,null,null,"jking@ssw.coop",null,"Treatment Systems"]
["All",null,"No",null,"Select Meter Size",null,"Two",null,"Arkansas",null,"Gila",null,"Arizona Public Service Company","E-01345A","PO Box 53999","Station 9708","Phoenix","85072-3999","AZ","Kerri.Carnes@aps.com",null,"Storage Tanks"]
["Residential",null,"N/A",null,"5/8\" x 3/4\" Meter",null,"Three",null,"California",null,"Graham",null,"Calpine Energy Solutions, LLC",null,"401 W. A St., Ste. 500",null,"San Diego",92101,"CA",null,null,"Booster Pumps"]
["Commercial",null,null,null,"3/4\"Meter",null,null,null,"Colorado",null,"Greenlee",null,"Columbus Electric","E-01851A",null,null,null,null,null,"chrism@col-coop.com",null,"Pressure Tanks"]
["Industrial",null,null,null,"1\" Meter",null,null,null,"Connecticut",null,"La Paz",null,"Dixie-Escalante Rural ","E-02044A",null,null,null,null,null,"ladell@dixiepower.com",null,"Customer Meters"]
["Bulk",null,null,null,"1-1/2\" Meter",null,null,null,"Delaware",null,"Maricopa",null,"Duncan Valley Electric","E-01073A",null,null,null,null,null,"stevel@dvec.org;kimberly@dvec.org",null,"Master Meters"]
["Stand-pipe",null,"MW",null,"2\" Meter",null,null,null,"Florida",null,"Mohave",null,"Garkane Energy","E-01891A",null,null,null,null,null,"marcus.lewis@garkane.com",null,"Main and Service Lines"]
["Fire",null,"KW",null,"3\" Meter",null,null,null,"Georgia",null,"Navajo",null,"Graham County Electric","E-01749A",null,null,null,null,null,"tashby@gce.coop",null,"Repair Equipment"]
["Hydrants",null,null,null,"4\" Meter",null,null,null,"Hawaii",null,"Pima",null,"Mohave Electric ","E-01750A",null,null,null,null,null,"pmink@mohaveelectric.com;mcolby@mohaveelectric.com",null,"Electrical Components"]
["Other",null,null,null,"6\" Meter",null,null,null,"Idaho",null,"Pinal",null,"Morenci Water & Electric Co. - Electric","E-01049A","PO Box 68",null,"Morenci",85540,"AZ","htaylor@fmi.com; dmedina@fmi.com"]
["N/A",null,null,null,"8\" Meter",null,null,null,"Illinois",null,"Santa Cruz",null,"Navopache Electric","E-01787A","1878 W. White Mountain Blvd.",null,"Lakeside",85929,"AZ","ggouker@navopache.org"]
[null,null,null,null,"10\" Meter",null,null,null,"Indiana",null,"Yavapai",null,"Nobel Americas Energy Solutions, LLC","E-03964A",null,null,null,null,null,"GBass@NobleSolutions.com"]
[null,null,null,null,"Fire",null,null,null,"Iowa",null,"Yuma",null,"Sulpher Springs Valley Electric","E-01575A",null,null,null,null,null,"chuber@ssvec.com;jgross@ssvec.com"]
{"$rows_left_out":35}